{"text_format":"3","workbook":"xlsx","n_sheets":4,"sheets":["Instructions","Details","Form 16","Form 16 A.."],"not_rendered":{"images":8,"macros":1,"external_links":1,"defined_names":5,"comments":2},"read":"whole","date_system":"1900"}

{"sheet":"Instructions","index":0,"n_rows":14,"n_cols":1,"rows_kept":14}
["ಮುಖ್ಯಾಂಶಗಳು"]
[]
["1. ಬಳಕೆದಾರರು ತಮ್ಮ ಕಂಪ್ಯೂಟರ್ ದಲ್ಲಿ Office 2007 ಇರುವದನ್ನು ಖಾತ್ರಿಪಡಿಸಿಕೊಳ್ಳಿ."]
["2. ಡಿಟೇಲ್ಸನಲ್ಲಿ ಮಾಹಿತಿ ತುಂಬಿದರೆ, ಪಾರ್ಮ 16 ಮತ್ತು ಪಾರ್ಮ 16A ಸಿದ್ದವಾಗುತ್ತದೆ."]
["4. ಕಾಲಮಿತಿ ಬಡ್ತಿ ಅಂದರೆ 10/15/20 ವರ್ಷದ ಬಡ್ತಿಯಿದ್ದಲ್ಲಿ, ಡಿಟೇಲ್ಸನಲ್ಲಿ ಕ್ರ.ಸಂ 13 ರಲ್ಲಿ ತುಂಬಿರಿ. ಕ್ರ.ಸಂ. 14 ರಲ್ಲಿ ಜಾರಿಯಾಗುವ "]
["     ದಿನಾಂಕ ಮತ್ತು ತಿಂಗಳು ನಮೂದಿಸಿರಿ."]
["5. ವರ್ಷದ ಮದ್ಯದಲ್ಲಿ ವರ್ಗಾವಣೆಯಾದವರಿಗೆ ಅನೂಕೂಲವಾಗಲು ಎಚ್.ಆರ್.ಎ ಮಾಹಿತಿ ತಿಂಗಳುವಾರು ಎ.ಬಿ.ಸಿ. ಗ್ರೇಡ್ ಆಯ್ಕೆಮಾಡಿರಿ."]
["6. ವಿಕಲಚೇತನರಿಗೆ ವಿಶೇಷವಾಗಿ ಇದನ್ನು ರಚಿಸಲಾಗಿದೆ. ಅಂದರೆ ವಿಕಲಚೇತನ Yes/ No ಎಂದು ಕ್ರ.ಸಂ. 16 & 21 ತುಂಬಿದರೆ ಅವರ ಸಂಚಾರಿ ಭತ್ಯೆ "]
["     ಲೆಕ್ಕಾಚಾರ ತಾನೆ ಮಾಡಿ ವೃತ್ತಿ ತೆರಿಗೆ ವಿನಾಯ್ತಿ ತೋರಿಸಿ, 80U, 10(14) ರಲ್ಲಿ ತೆರಿಗೆ ವಿನಾಯ್ತಿ ತೋರಿಸುತ್ತದೆ."]
["7. ಟ್ಯಾಕ್ಸೆಬಲ್ ಆದಾಯ 5 ಲಕ್ಷದೊಳಗೆ ಇದ್ದರೆ 0% ತೆರಿಗೆ, 5 ಲಕ್ಷದಿಂದ 10 ಲಕ್ಷದೊಳಗೆ ಇದ್ದರೆ 20% ಮತ್ತು "]
{"$rows_left_out":5}
{"sheet":"Details","index":1,"n_rows":68,"n_cols":106,"rows_kept":68,"merged":[[0,0,0,9],[1,2,1,9],[2,2,2,5],[3,2,3,3],[3,5,3,6],[3,8,3,9],[4,2,4,9],[5,2,5,9],[6,2,6,5],[7,2,7,5],[8,2,8,3],[9,2,9,9],[24,0,25,0],[24,2,25,2],[26,6,26,7],[31,2,31,3],[32,2,32,4],[33,2,33,4],[34,2,34,3]]}
["Employees Payment Details for I T Calculation",{"$nulls":9},{"$f":"C11","v":62600},null,null,200,250,300,350,400,450,500,600,700,800,900,1050,1200,1350,1500,1700,null,300,{"$nulls":3},350,{"$nulls":3},400,{"$nulls":3},450,{"$nulls":3},500,{"$nulls":3},600,{"$nulls":5},700,{"$nulls":5},800,{"$nulls":5},900,{"$nulls":5},1050,{"$nulls":5},1200,{"$nulls":5},1350,{"$nulls":6},1500,{"$nulls":3},1700]
["1. Name of Employee",null,"ಶ್ರೀನಿವಾಸ ಹೆಚ್.ಟಿ.",{"$nulls":7},{"$f":"K1","v":62600},{"$f":"IF(D18=\"Mar\",K1+K14,IF(D18=\"Apl\",K1,IF(D18=\"May\",K1,IF(D18=\"Jun\",K1,IF(D18=\"Jul\",K1,IF(D18=\"Aug\",K1,IF(D18=\"Sep\",K1,IF(D18=\"Oct\",K1,IF(D18=\"Nov\",K1,IF(D18=\"Dec\",K1,IF(D18=\"Jan\",K1,IF(D18=\"Feb\",K1))))))))))))","v":62600},{"$f":"IF(K2<18600,O3,IF(K2<20400,P3,IF(K2<22400,Q3,IF(K2<24600,R3,IF(K2<27000,S3,IF(K2<29600,T3,IF(K2<32600,U3,IF(K2<36000,V3,IF(K2<39800,W3,IF(K2<46400,X3,IF(K2<51400,Y3,IF(K2<62600,Z3,IF(K2<72500,AA3,IF(K2<83900,AB3,IF(K2<97100,AC3,IF(K2<112100,AD3,IF(K2<128900,AE3,IF(K2<150600,AF3,))))))))))))))))))","v":1650},"17000-400-18600-450-20400-500-22400-550-24600-600-27000-650--28950",9600,9800,10000,{"$f":"Q2+200","v":10200},{"$f":"R2+200","v":10400},10600,10800,11000,{"$f":"V2+200","v":11200},11400,11600,11800,{"$f":"Z2+200","v":12000},{"$f":"AA2+250","v":12250},{"$f":"AB2+250","v":12500},12750,13000,{"$f":"AE2+300","v":13300},{"$f":"AF2+300","v":13600},13900,14200,{"$f":"AI2+350","v":14550},{"$f":"AJ2+350","v":14900},15250,15600,{"$f":"AM2+400","v":16000},{"$f":"AN2+400","v":16400},16800,17200,{"$f":"AQ2+450","v":17650},{"$f":"AR2+450","v":18100},18550,19000,{"$f":"AU2+500","v":19500},{"$f":"AV2+500","v":20000},20500,{"$f":"AX2+500","v":21000},{"$f":"AY2+600","v":21600},{"$f":"AZ2+600","v":22200},22800,23400,24000,24600,{"$f":"BE2+700","v":25300},{"$f":"BF2+700","v":26000},{"$f":"BG2+700","v":26700},{"$f":"BH2+700","v":27400},28100,28800,{"$f":"BK2+800","v":29600},{"$f":"BL2+800","v":30400},31200,32000,32800,33600,{"$f":"BQ2+900","v":34500},{"$f":"BR2+900","v":35400},{"$f":"BS2+900","v":36300},{"$f":"BT2+900","v":37200},38100,39000,{"$f":"BW2+1050","v":40050},41100,42150,43200,44250,45300,{"$f":"CC2+1200","v":46500},{"$f":"CD2+1200","v":47700},48900,50100,51300,52500,{"$f":"CI2+1350","v":53850},{"$f":"CJ2+1350","v":55200},56550,57900,59250,60600,62100,63600,66600,68100,69600,71300,73000]
["2. Designation,",null,"ದೈಹಿಕ ಶಿಕ್ಷಣ ಶಿಕ್ಷಕರು(ಗ್ರೇಡ್-1)",{"$nulls":7},{"$f":"K2","v":62600},{"$f":"IF(D18=\"Mar\",K2+L15,IF(D18=\"Apl\",K2+K14,IF(D18=\"May\",K2,IF(D18=\"Jun\",K2,IF(D18=\"Jul\",K2,IF(D18=\"Aug\",K2,IF(D18=\"Sep\",K2,IF(D18=\"Oct\",K2,IF(D18=\"Nov\",K2,IF(D18=\"Dec\",K2,IF(D18=\"Jan\",K2,IF(D18=\"Feb\",K2))))))))))))","v":62600},{"$f":"IF(K3<18600,O3,IF(K3<20400,P3,IF(K3<22400,Q3,IF(K3<24600,R3,IF(K3<27000,S3,IF(K3<29600,T3,IF(K3<32600,U3,IF(K3<36000,V3,IF(K3<39800,W3,IF(K3<46400,X3,IF(K3<51400,Y3,IF(K3<62600,Z3,IF(K3<72500,AA3,IF(K3<83900,AB3,IF(K3<97100,AC3,IF(K3<112100,AD3,IF(K3<128900,AE3,IF(K3<150600,AF3,))))))))))))))))))","v":1650},"18600-450-20400-500-22400-550-24600-600-27000-650--29600-750-32600",400,450,500,550,600,650,750,850,950,1100,1250,1450,1650,1900,2200,2500,2800,3100]
["3. PAN Number/ KGID No.",null,"AXTPS4023M",null,"KGID No.",1260321,null,"Aadhar",497378753229,null,{"$f":"K3","v":62600},{"$f":"IF(D18=\"Mar\",K3+L15,IF(D18=\"Apl\",K3+L15,IF(D18=\"May\",K3+K14,IF(D18=\"Jun\",K3,IF(D18=\"Jul\",K3,IF(D18=\"Aug\",K3,IF(D18=\"Sep\",K3,IF(D18=\"Oct\",K3,IF(D18=\"Nov\",K3,IF(D18=\"Dec\",K3,IF(D18=\"Jan\",K3,IF(D18=\"Feb\",K3))))))))))))","v":62600},{"$f":"IF(K4<18600,O3,IF(K4<20400,P3,IF(K4<22400,Q3,IF(K4<24600,R3,IF(K4<27000,S3,IF(K4<29600,T3,IF(K4<32600,U3,IF(K4<36000,V3,IF(K4<39800,W3,IF(K4<46400,X3,IF(K4<51400,Y3,IF(K4<62600,Z3,IF(K4<72500,AA3,IF(K4<83900,AB3,IF(K4<97100,AC3,IF(K4<112100,AD3,IF(K4<128900,AE3,IF(K4<150600,AF3,))))))))))))))))))","v":1650},"19950-450-20400-500-22400-550-24600-600-27000-650-29600-750-32600-850-36000-950-37900",17000,{"$f":"O4+400","v":17400},{"$f":"P4+400","v":17800},18200,18600,{"$f":"S4+450","v":19050},{"$f":"T4+450","v":19500},19950,{"$f":"V4+450","v":20400},{"$f":"W4+500","v":20900},{"$f":"X4+500","v":21400},21900,22400,{"$f":"AA4+550","v":22950},{"$f":"AB4+550","v":23500},24050,24600,{"$f":"AE4+600","v":25200},{"$f":"AF4+600","v":25800},26400,27000,{"$f":"AI4+650","v":27650},{"$f":"AJ4+650","v":28300},28950,29600,{"$f":"AM4+750","v":30350},{"$f":"AN4+750","v":31100},31850,32600,{"$f":"AQ4+850","v":33450},{"$f":"AR4+850","v":34300},35150,36000,{"$f":"AU4+950","v":36950},{"$f":"AV4+950","v":37900},38850,39800,{"$f":"AY4+1100","v":40900},{"$f":"AZ4+1100","v":42000},43100,44200,45300,46400,{"$f":"BE4+1250","v":47650},{"$f":"BF4+1250","v":48900},50150,51400,52650,53900,{"$f":"BK4+1450","v":55350},{"$f":"BL4+1450","v":56800},58250,59700,61150,62600,{"$f":"BQ4+1650","v":64250},{"$f":"BR4+1650","v":65900},67550,69200,70850,72500,{"$f":"BW4+1900","v":74400},{"$f":"BX4+1900","v":76300},78200,80100,82000,83900,{"$f":"CC4+2200","v":86100},{"$f":"CD4+2200","v":88300},90500,92700,94900,97100,{"$f":"CI4+2500","v":99600},{"$f":"CJ4+2500","v":102100},104600,107100,109600,112100,{"$f":"CO4+2800","v":114900},{"$f":"CP4+2800","v":117700},120500,123300,126100,128900,{"$f":"CU4+3100","v":132000},{"$f":"CV4+3100","v":135100},138200,141300,144400,147500,150600]
["4. Residential Address.",null,"2718 E BLOCK, KANAKADASANAGARA MYSORE",{"$nulls":7},{"$f":"IF(C14=\"Jan\",C11,IF(C14=\"Jul\",C11+C15))","v":62600},{"$f":"IF(D18=\"Mar\",K4+L15,IF(D18=\"Apl\",K4+L15,IF(D18=\"May\",K4+L15,IF(D18=\"Jun\",K4+K14,IF(D18=\"Jul\",K4,IF(D18=\"Aug\",K4,IF(D18=\"Sep\",K4,IF(D18=\"Oct\",K4,IF(D18=\"Nov\",K4,IF(D18=\"Dec\",K4,IF(D18=\"Jan\",K4,IF(D18=\"Feb\",K4))))))))))))","v":62600},{"$f":"IF(K5<18600,O3,IF(K5<20400,P3,IF(K5<22400,Q3,IF(K5<24600,R3,IF(K5<27000,S3,IF(K5<29600,T3,IF(K5<32600,U3,IF(K5<36000,V3,IF(K5<39800,W3,IF(K5<46400,X3,IF(K5<51400,Y3,IF(K5<62600,Z3,IF(K5<72500,AA3,IF(K5<83900,AB3,IF(K5<97100,AC3,IF(K5<112100,AD3,IF(K5<128900,AE3,IF(K5<150600,AF3,))))))))))))))))))","v":1650},"21400-500-22400-550-24600-600-27000-650-29600-750-32600-850-36000-950-39800-1100-42000"]
["5. Office Address.",null,"GJC(HS) KARIMUDDANAHALLI, HUNSUR TQ.",{"$nulls":7},{"$f":"K5","v":62600},{"$f":"IF(D18=\"Mar\",K5+L15,IF(D18=\"Apl\",K5+L15,IF(D18=\"May\",K5+L15,IF(D18=\"Jun\",K5+L15,IF(D18=\"Jul\",K5+K14,IF(D18=\"Aug\",K5,IF(D18=\"Sep\",K5,IF(D18=\"Oct\",K5,IF(D18=\"Nov\",K5,IF(D18=\"Dec\",K5,IF(D18=\"Jan\",K5,IF(D18=\"Feb\",K5))))))))))))","v":62600},{"$f":"IF(K6<18600,O3,IF(K6<20400,P3,IF(K6<22400,Q3,IF(K6<24600,R3,IF(K6<27000,S3,IF(K6<29600,T3,IF(K6<32600,U3,IF(K6<36000,V3,IF(K6<39800,W3,IF(K6<46400,X3,IF(K6<51400,Y3,IF(K6<62600,Z3,IF(K6<72500,AA3,IF(K6<83900,AB3,IF(K6<97100,AC3,IF(K6<112100,AD3,IF(K6<128900,AE3,IF(K6<150600,AF3,))))))))))))))))))","v":1650},"23500-550-22400-550-24600-600-27000-650-29600-750-32600-850-36000-950-39800-1100-46400-1250-47650"]
["6. Name of Controlling Authority.",null,"NANJUSNDAIAH",{"$nulls":7},{"$f":"K6","v":62600},{"$f":"IF(D18=\"Mar\",K6+L15,IF(D18=\"Apl\",K6+L15,IF(D18=\"May\",K6+L15,IF(D18=\"Jun\",K6+L15,IF(D18=\"Jul\",K6+L15,IF(D18=\"Aug\",K6+K14,IF(D18=\"Sep\",K6,IF(D18=\"Oct\",K6,IF(D18=\"Nov\",K6,IF(D18=\"Dec\",K6,IF(D18=\"Jan\",K6,IF(D18=\"Feb\",K6))))))))))))","v":62600},{"$f":"IF(K7<18600,O3,IF(K7<20400,P3,IF(K7<22400,Q3,IF(K7<24600,R3,IF(K7<27000,S3,IF(K7<29600,T3,IF(K7<32600,U3,IF(K7<36000,V3,IF(K7<39800,W3,IF(K7<46400,X3,IF(K7<51400,Y3,IF(K7<62600,Z3,IF(K7<72500,AA3,IF(K7<83900,AB3,IF(K7<97100,AC3,IF(K7<112100,AD3,IF(K7<128900,AE3,IF(K7<150600,AF3,))))))))))))))))))","v":1650},"25800-600-27000-650-29600-750-32600-850-36000-950-39800-1100-46400-1250-51400"]
["7. Designation of Controlling Authority.",null,"SENIOR ASSISTANT TEACHER",{"$nulls":7},{"$f":"K7","v":62600},{"$f":"IF(D18=\"Mar\",K7+L15,IF(D18=\"Apl\",K7+L15,IF(D18=\"May\",K7+L15,IF(D18=\"Jun\",K7+L15,IF(D18=\"Jul\",K7+L15,IF(D18=\"Aug\",K7+L15,IF(D18=\"Sep\",K8+K14,IF(D18=\"Oct\",K7,IF(D18=\"Nov\",K7,IF(D18=\"Dec\",K7,IF(D18=\"Jan\",K7,IF(D18=\"Feb\",K7))))))))))))","v":62600},{"$f":"IF(K8<18600,O3,IF(K8<20400,P3,IF(K8<22400,Q3,IF(K8<24600,R3,IF(K8<27000,S3,IF(K8<29600,T3,IF(K8<32600,U3,IF(K8<36000,V3,IF(K8<39800,W3,IF(K8<46400,X3,IF(K8<51400,Y3,IF(K8<62600,Z3,IF(K8<72500,AA3,IF(K8<83900,AB3,IF(K88<97100,AC3,IF(K8<112100,AD3,IF(K8<128900,AE3,IF(K8<150600,AF3,))))))))))))))))))","v":1650},"27650-650-29600-750-32600-850-36000-950-39800-1100-46400-1250-52650"]
["8. TAN number.",{"$nulls":9},{"$f":"K8","v":62600},{"$f":"IF(D18=\"Mar\",K8+L15,IF(D18=\"Apl\",K8+L15,IF(D18=\"May\",K8+L15,IF(D18=\"Jun\",K8+L15,IF(D18=\"Jul\",K8+L15,IF(D18=\"Aug\",K8+L15,IF(D18=\"Sep\",K8+L15,IF(D18=\"Oct\",K8+K14,IF(D18=\"Nov\",K8,IF(D18=\"Dec\",K8,IF(D18=\"Jan\",K8,IF(D18=\"Feb\",K8))))))))))))","v":62600},{"$f":"IF(K9<18600,O3,IF(K9<20400,P3,IF(K9<22400,Q3,IF(K9<24600,R3,IF(K9<27000,S3,IF(K9<29600,T3,IF(K9<32600,U3,IF(K9<36000,V3,IF(K9<39800,W3,IF(K9<46400,X3,IF(K9<51400,Y3,IF(K9<62600,Z3,IF(K9<72500,AA3,IF(K9<83900,AB3,IF(K9<97100,AC3,IF(K9<112100,AD3,IF(K9<128900,AE3,IF(K9<150600,AF3,))))))))))))))))))","v":1650},"30350-750-32600-850-36000-950-39800-1100-46400-1250-53900-1450-58250"]
["9. Scale of Employee.",null,"43100-1100-46400-1250-53900-1450-62600-1650-72500-1900-83900",{"$nulls":7},{"$f":"K9","v":62600},{"$f":"IF(D18=\"Mar\",K9+L15,IF(D18=\"Apl\",K9+L15,IF(D18=\"May\",K9+L15,IF(D18=\"Jun\",K9+L15,IF(D18=\"Jul\",K9+L15,IF(D18=\"Aug\",K9+L15,IF(D18=\"Sep\",K9+L15,IF(D18=\"Oct\",K9+L15,IF(D18=\"Nov\",K9+K14,IF(D18=\"Dec\",K9,IF(D18=\"Jan\",K9,IF(D18=\"Feb\",K9))))))))))))","v":62600},{"$f":"IF(K10<18600,O3,IF(K10<20400,P3,IF(K10<22400,Q3,IF(K10<24600,R3,IF(K10<27000,S3,IF(K10<29600,T3,IF(K10<32600,U3,IF(K10<36000,V3,IF(K10<39800,W3,IF(K10<46400,X3,IF(K10<51400,Y3,IF(K10<62600,Z3,IF(K10<72500,AA3,IF(K10<83900,AB3,IF(K10<97100,AC3,IF(K10<112100,AD3,IF(K10<128900,AE3,IF(K10<150600,AF3,))))))))))))))))))","v":1650},"33450-850-36000-950-39800-1100-46400-1250-53900-1450-62600"]
{"$rows_left_out":59}
{"sheet":"Form 16","index":2,"n_rows":78,"n_cols":20,"rows_kept":78,"merged":[[1,0,77,0],[1,1,1,17],[2,14,2,15],[3,1,3,2],[3,3,3,8],[3,14,3,17],[4,1,4,2],[4,3,4,7],[4,9,4,12],[4,14,4,17],[6,1,7,1],[6,2,6,10],[6,11,6,17],[37,2,37,3],[37,4,37,5],[37,6,37,8],[37,11,37,12],[38,11,38,12],[39,5,39,7],[39,9,39,12],[39,14,39,15],[40,12,40,13],[40,15,40,16],[41,2,41,11],[41,12,41,13],[41,15,41,16],[41,17,44,17],[42,12,42,13],[42,15,44,16],[43,12,43,13],[44,12,44,13],[45,12,45,13],[45,15,45,16],[46,12,46,13],[46,15,46,16],[47,6,47,11],[47,12,47,13],[47,15,47,16],[48,7,48,10],[48,12,48,13],[48,15,48,16],[49,7,49,10],[49,12,49,13],[49,15,49,16],[50,12,50,13],[50,15,50,16],[51,12,51,13],[51,15,51,16],[52,6,52,9],[52,12,52,13],[52,15,52,16],[53,12,53,13],[53,15,53,16],[54,12,54,13],[54,15,54,16],[55,12,55,13],[55,15,55,16],[56,8,56,9],[56,12,56,13],[56,15,56,16],[57,5,57,7],[57,12,57,13],[57,15,57,16],[58,12,58,13],[58,15,58,16],[59,12,59,16],[76,3,76,4],[77,3,77,4]]}
[]
["KARUNADU DIVYANGA NAUKARAR SANGHA         ಕರುನಾಡು ದಿವ್ಯಾಂಗ ನೌಕರರ ಸಂಘ     KARUNADU DIVYANGA NAUKARAR SANGHA         ಕರುನಾಡು ದಿವ್ಯಾಂಗ ನೌಕರರ ಸಂಘ   KARUNADU DIVYANGA NAUKARAR SANGHA         ಕರುನಾಡು ದಿವ್ಯಾಂಗ ನೌಕರರ ಸಂಘ","DETAILS OF SALARY & DEDUCTIONS for the Financial Year of 2019- 20 A.Y.2020-21"]
[null,"Name :",{"$f":"Details!C2","v":"ಶ್ರೀನಿವಾಸ ಹೆಚ್.ಟಿ."},{"$nulls":6},"Designation : ",{"$f":"Details!C3","v":"ದೈಹಿಕ ಶಿಕ್ಷಣ ಶಿಕ್ಷಕರು(ಗ್ರೇಡ್-1)"},null,null,"KGID No.",{"$f":"Details!F4","v":1260321}]
[null,"Permnent  Address:",null,{"$f":"Details!C5","v":"2718 E BLOCK, KANAKADASANAGARA MYSORE"},{"$nulls":5},"Office Address",{"$nulls":3},"TAN No",{"$f":"Details!C9","v":0},{"$nulls":3},{"$f":"IF(Details!C12=\"Yes\",300,IF(Details!C12=\"No\",0))","v":0},{"$f":"Details!C25","v":0}]
[null,"Aadhar No.",null,{"$f":"Details!I4","v":497378753229},{"$nulls":5},{"$f":"Details!C6","v":"GJC(HS) KARIMUDDANAHALLI, HUNSUR TQ."},{"$nulls":3},"PAN No",{"$f":"Details!C4","v":"AXTPS4023M"},{"$nulls":3},{"$f":"S4+T4","v":0}]
[null,null,"Scale",{"$f":"Details!C10","v":"43100-1100-46400-1250-53900-1450-62600-1650-72500-1900-83900"},{"$nulls":15},10]
[null,"Month YEAR","SALARY",{"$nulls":8},"DEDUCTIONS"]
[null,null,"PAY","Char All","D A","HRA","MA","PHA","S F N + Unu All"," CCA","TOTAL","P T","G P F","K G I D","L I C","NPS","GIS /FBF","I T ",null,{"$f":"IF(Details!C23=\"A\",480,IF(Details!C23=\"B\",360,IF(Details!C23=\"C\",240,IF(Details!C23=\"D\",120))))","v":360}]
[null,"2019-03-01",{"$f":"IF(Details!C13=\"Regular\",Details!L2,IF(Details!C13=\"Stagnation\",Details!K18))","v":{"v":62600,"d":"62,600"}},0,{"$f":"ROUND((C9)*S9%,0)","v":{"v":2348,"d":"2,348"}},{"$f":"ROUND(IF(Details!J13=\"A\",(C10)*24%,IF(Details!J13=\"B\",(C10)*16%,IF(Details!J13=\"C\",(C10)*8%))),0)","v":{"v":5008,"d":"5,008"}},{"$f":"IF(Details!C28=\"Yes\",200,IF(Details!C28=\"No\",0))","v":0},{"$f":"ROUND(IF(Details!C27=\"Yes\",(C9+D9)*6%,IF(Details!C27=\"No\",0)),0)","v":0},{"$f":"S5","v":0},{"$f":"IF(Details!J12=\"A\",Details!C24,IF(Details!J12=\"B\",Details!C24,IF(Details!J12=\"C\",0)))","v":0},{"$f":"C9+D9+E9+F9+G9+H9+I9+J9","v":{"v":69956,"d":"69,956"}},{"$f":"IF(Details!C19=\"Yes\",0,IF(Details!C19=\"No\",200))","v":200},{"$f":"IF(Details!C21=\"No\",Details!F12,IF(Details!C21=\"Yes\",\"0\"))","v":{"v":2000,"d":"2,000"}},{"$f":"Details!G12","v":{"v":2000,"d":"2,000"}},{"$f":"Details!H12","v":{"v":1272,"d":"1,272"}},{"$f":"ROUND(IF(Details!C21=\"Yes\",(C9+E9)*10%,IF(Details!C21=\"No\",0)),0)","v":0},{"$f":"IF(Details!C22=\"Govt\",T8,IF(Details!C22=\"Private\",T6))","v":360},{"$f":"Details!I12","v":0},3.75]
[null,"2019-04-01",{"$f":"IF(Details!C13=\"Regular\",Details!L3,IF(Details!C13=\"Stagnation\",Details!K19))","v":{"v":62600,"d":"62,600"}},0,{"$f":"ROUND((C10)*S10%,0)","v":{"v":4069,"d":"4,069"}},{"$f":"ROUND(IF(Details!J13=\"A\",(C10)*24%,IF(Details!J13=\"B\",(C10)*16%,IF(Details!J13=\"C\",(C10)*8%))),0)","v":{"v":5008,"d":"5,008"}},{"$f":"G9","v":0},{"$f":"ROUND(IF(Details!C27=\"Yes\",(C10+D10)*6%,IF(Details!C27=\"No\",0)),0)","v":0},{"$f":"I9","v":0},{"$f":"IF(Details!J13=\"A\",Details!C24,IF(Details!J13=\"B\",Details!C24,IF(Details!J13=\"C\",0)))","v":0},{"$f":"C10+D10+E10+F10+G10+H10+I10+J10","v":{"v":71677,"d":"71,677"}},{"$f":"L9","v":200},{"$f":"IF(Details!C21=\"No\",Details!F13,IF(Details!C21=\"Yes\",\"0\"))","v":{"v":2000,"d":"2,000"}},{"$f":"Details!G13","v":{"v":2000,"d":"2,000"}},{"$f":"Details!H13","v":{"v":1272,"d":"1,272"}},{"$f":"ROUND(IF(Details!C21=\"Yes\",(C10+E10)*10%,IF(Details!C21=\"No\",0)),0)","v":0},{"$f":"IF(Details!C22=\"Govt\",T8,IF(Details!C22=\"Private\",T6))","v":360},{"$f":"Details!I13","v":0},6.5]
{"$rows_left_out":69}
{"sheet":"Form 16 A..","index":3,"n_rows":64,"n_cols":9,"rows_kept":64,"merged":[[0,0,63,0],[0,1,0,7],[1,1,1,7],[2,1,2,7],[3,1,3,3],[3,4,3,7],[4,1,4,3],[4,4,4,7],[5,1,5,3],[6,1,6,3],[6,4,6,7],[7,1,7,2],[8,1,8,2],[9,1,10,3],[9,5,9,6],[11,1,11,7],[18,1,18,3],[22,12,22,13],[23,12,23,13],[24,12,24,13],[25,12,25,13],[26,12,26,13],[27,12,27,13],[28,12,28,13],[29,8,29,10],[29,12,29,13],[30,8,30,10],[30,12,30,13],[31,12,31,13],[32,12,32,13],[33,12,33,13],[34,12,34,13],[35,12,35,13],[36,12,36,13],[37,12,37,13],[38,12,38,13],[39,12,39,13],[40,1,40,4],[41,1,41,3],[42,1,42,3],[43,1,43,4],[44,1,44,2],[47,1,47,2],[48,1,48,4],[49,1,49,2],[52,2,52,7],[53,5,53,7],[54,5,54,7],[55,5,55,7],[56,5,56,7],[57,5,57,7],[58,1,58,2],[59,2,59,7],[62,4,62,7]]}
["KARUNADU DIVYANGA NAUKARAR SANGHA - ಕರುನಾಡು ದಿವ್ಯಾಂಗ ನೌಕರರ ಸಂಘ - KARUNADU DIVYANGA NAUKARAR SANGHA - ಕರುನಾಡು ದಿವ್ಯಾಂಗ ನೌಕರರ ಸಂಘ - KARUNADU DIVYANGA NAUKARAR SANGHA - ಕರುನಾಡು ದಿವ್ಯಾಂಗ ನೌಕರರ ಸಂಘ","FORM NO 16"]
[null,"(See Rule 31 (1) (a))"]
[null,"Certified under 203 of Income Tax Act 1961 for Tax deducted at Source from Income Chargable under the head \"Salaries\""]
[null,"NAME & ADDRESS OF THE EMPLOYER",null,null,"NAME & DESIGNATION OF THE EMPLOYEE"]
[null,{"$f":"Details!C7","v":"NANJUSNDAIAH"},null,null,{"$f":"'Form 16'!C3","v":"ಶ್ರೀನಿವಾಸ ಹೆಚ್.ಟಿ."}]
[null,{"$f":"Details!C8","v":"SENIOR ASSISTANT TEACHER"},{"$nulls":3},{"$f":"'Form 16'!K3","v":"ದೈಹಿಕ ಶಿಕ್ಷಣ ಶಿಕ್ಷಕರು(ಗ್ರೇಡ್-1)"},"KGID No.",{"$f":"Details!F4","v":1260321}]
[null,{"$f":"E7","v":"GJC(HS) KARIMUDDANAHALLI, HUNSUR TQ."},null,null,{"$f":"'Form 16'!J5","v":"GJC(HS) KARIMUDDANAHALLI, HUNSUR TQ."}]
[null,"PAN No",null,"TAN No","PAN No","Aadhar No","IFSC Code","Saving A/C Number"]
[{"$nulls":3},{"$f":"'Form 16'!O4","v":0},{"$f":"'Form 16'!O5","v":"AXTPS4023M"},{"$f":"'Form 16'!D5","v":497378753229},{"$f":"Details!C34","v":"SBIN0001730"},{"$f":"Details!C33","v":{"v":35218478899,"d":"035218478899"}}]
[null,"TDS Circle where Annual Return / statement under section 206 to be filed   I.T.O. - III Hubli",null,null,"Date of Birth of Employee","Period",null,"Assessment Year"]
{"$rows_left_out":54}